{"text_format":"1","workbook":"xlsx","n_sheets":9,"sheets":["(はじめにお読み下さい)申請書の使い方","申請書","申請額一覧","別添","個票1","請求書","委任状","職員表","計算用"],"not_rendered":{"charts":0,"images":0,"macros":1,"external_links":0,"defined_names":10,"comments":7,"pivot_tables":0},"unopened":[],"bounds":{"document_bytes":16777216,"sheet_cells":100000,"rows_first":2000,"rows_last":500,"rows_between":2000,"halvings":0,"cell_chars":16384,"cell_head_chars":4096},"cells_cut":0,"cells_raw":0,"read":"whole","date_system":"1900"}

{"sheet":"(はじめにお読み下さい)申請書の使い方","index":0,"n_rows":17,"n_cols":4,"rows_kept":17,"cut":false,"hidden":false,"merged":[[1,0,1,3],[2,0,2,3],[3,0,3,3]]}
[]
["本申請書の使い方、申請の手順【県（長寿介護課）提出用】"]
["※支援金分のみ入力して申請してください。"]
["※慰労金を申請する場合、別に定めた様式（県ホームページ掲載）にて申請してください。"]
["手順","都道府県の作業","事業者（法人本部）の作業","各事業所の作業"]
[1,"本Excelを管内の介護サービス事業者に配布"]
[{"$f":"A6+1","v":2},null,"本Excelを各事業所に配布し、以下の様式への記入を依頼\n・別記様式第２号（個票）\n※Excelファイルを開封した際は、｢コンテンツの有効化｣をクリック"]
[{"$f":"A7+1","v":3},null,null,"以下の作業を行った上で、事業者（法人本部）へ返送\n【別記様式第２号（個票）】\n・水色セル：必要情報を入力\n・緑色セル：プルダウンから選択"]
[4,null,"各事業所の個票のシートを１つのExcelファイルに集約し、個票シート名を「個票●」（●は１からの通し番号）に修正"]
[5,null,"「介護保険事業所番号」について\n有料老人ホーム等の介護保険事業所番号がない場合、\n仮事業所番号として、10桁で「450000000●」と入力。10桁目の「●」には「個表●」の「●」と同じ数字を入力してください。\n【例】\n「個表１」の場合、「4500000001」とする。\n「個表２」の場合、「4500000002」とする。\n※国保連提出のデータには入れないでください（県提出データにまとめる）。"]
{"$rows_left_out":8}
{"sheet":"申請書","index":1,"n_rows":41,"n_cols":62,"rows_kept":41,"cut":false,"hidden":false,"merged":[[40,28,40,36],[39,20,40,22],[39,24,39,27],[40,24,40,27],[9,0,9,38],[37,20,37,26],[38,20,38,26],[37,28,37,36],[38,28,38,36],[39,28,39,36],[13,1,13,9],[13,10,13,17],[17,2,17,22],[36,28,36,36],[35,20,36,27],[35,29,35,32],[2,35,2,36],[2,32,2,33],[2,29,2,30],[18,2,18,22],[19,2,19,22],[16,2,16,22],[16,23,16,27],[17,23,17,27],[18,23,18,27],[19,23,19,27],[4,0,4,6],[6,22,6,36],[7,22,7,36],[17,47,17,48],[17,53,17,54],[18,47,18,48],[18,53,18,54],[17,59,17,60],[18,59,18,60]]}
["別記様式第１号（第４条関係）",null,null,null,null,null,null,null,null,null,null,null,null,null,null,null,null,null,null,null,null,null,null,null,null,null,null,null,null,null,null,null,null,null,null,null,null,null,"（別添２）"]
[]
[null,null,null,null,null,null,null,null,null,null,null,null,null,null,null,null,null,null,null,null,null,null,null,null,null,null,null,null,"　　令和",null,null,"年",null,null,"月",null,null,"日"]
[]
["宮崎県知事",null,null,null,null,null,null,null,"殿"]
[]
[null,null,null,null,null,null,null,null,null,null,null,null,null,null,null,null,null,null,null,null,null,"（法人名）"]
[null,null,null,null,null,null,null,null,null,null,null,null,null,null,null,null,null,null,null,null,null,"（役職・代表者名）",null,null,null,null,null,null,null,null,null,null,null,null,null,null,null,"印"]
[]
["　　　　令和２年度新型コロナウイルス感染症緊急包括支援交付金（介護分）（介護\n　　　　サービス事業所等感染症対策支援事業費補助金）に係る交付申請書【介護支援金】"]
{"$rows_left_out":32}
{"sheet":"申請額一覧","index":2,"n_rows":104,"n_cols":14,"rows_kept":104,"cut":false,"hidden":false,"merged":[[2,5,3,5],[2,6,3,6],[2,7,2,12],[2,13,3,13],[2,0,3,0],[2,2,3,2],[2,1,3,1],[2,3,3,3],[2,4,3,4]]}
["（別添１）事業所・施設別申請額一覧"]
[]
["No.","介護保険\n事業所番号","事業所・施設名","電話番号","郵便番号","住所","代表となる\n事業所・施設名","補助予定額（千円）",null,null,null,null,null,"審査\n結果"]
[null,null,null,null,null,null,null,"介護\n慰労金","20万円\n対象者の\n有無","感染対策\n費用助成\n事業","個別再開\n支援助成\n事業","再開環境\n整備助成\n事業","合計"]
[{"$f":"ROW()-4","v":1},null,{"$f":"IFERROR(VLOOKUP($B5,別添!$B$5:$G$29,2,FALSE),\"\")","v":0},{"$f":"IFERROR(VLOOKUP($B5,別添!$B$5:$G$29,4,FALSE),\"\")","v":0},{"$f":"IFERROR(VLOOKUP($B5,別添!$B$5:$G$29,5,FALSE),\"\")","v":0},{"$f":"IFERROR(VLOOKUP($B5,別添!$B$5:$G$29,6,FALSE),\"\")","v":""},{"$f":"IF(M5>0,申請書!$W$7,\"\")","v":""},{"$f":"SUMIFS(別添!I$5:I$29,別添!$B$5:$B$29,$B5)","v":0},{"$f":"IFERROR(IF(COUNTIFS(別添!$B$5:$B$29,B5,別添!$J$5:$J$29,\"有\")>0,\"有\",\"\"),\"\")","v":""},{"$f":"SUMIFS(別添!K$5:K$29,別添!$B$5:$B$29,$B5)","v":0},{"$f":"SUMIFS(別添!L$5:L$29,別添!$B$5:$B$29,$B5)","v":0},{"$f":"SUMIFS(別添!M$5:M$29,別添!$B$5:$B$29,$B5)","v":0},{"$f":"SUM(H5,J5,K5,L5)","v":0}]
[{"$f":"ROW()-4","v":2},"",{"$f":"IFERROR(VLOOKUP($B6,別添!$B$5:$G$29,2,FALSE),\"\")","v":""},{"$f":"IFERROR(VLOOKUP($B6,別添!$B$5:$G$29,4,FALSE),\"\")","v":""},{"$f":"IFERROR(VLOOKUP($B6,別添!$B$5:$G$29,5,FALSE),\"\")","v":""},{"$f":"IFERROR(VLOOKUP($B6,別添!$B$5:$G$29,6,FALSE),\"\")","v":""},{"$f":"IF(M6>0,申請書!$W$7,\"\")","v":""},{"$f":"SUMIFS(別添!I$5:I$29,別添!$B$5:$B$29,$B6)","v":0},{"$f":"IFERROR(IF(COUNTIFS(別添!$B$5:$B$29,B6,別添!$J$5:$J$29,\"有\")>0,\"有\",\"\"),\"\")","v":""},{"$f":"SUMIFS(別添!K$5:K$29,別添!$B$5:$B$29,$B6)","v":0},{"$f":"SUMIFS(別添!L$5:L$29,別添!$B$5:$B$29,$B6)","v":0},{"$f":"SUMIFS(別添!M$5:M$29,別添!$B$5:$B$29,$B6)","v":0},{"$f":"SUM(H6,J6,K6,L6)","v":0}]
[3,null,{"$f":"IFERROR(VLOOKUP($B7,別添!$B$5:$G$29,2,FALSE),\"\")","v":0},{"$f":"IFERROR(VLOOKUP($B7,別添!$B$5:$G$29,4,FALSE),\"\")","v":0},{"$f":"IFERROR(VLOOKUP($B7,別添!$B$5:$G$29,5,FALSE),\"\")","v":0},{"$f":"IFERROR(VLOOKUP($B7,別添!$B$5:$G$29,6,FALSE),\"\")","v":""},{"$f":"IF(M7>0,申請書!$W$7,\"\")","v":""},{"$f":"SUMIFS(別添!I$5:I$29,別添!$B$5:$B$29,$B7)","v":0},{"$f":"IFERROR(IF(COUNTIFS(別添!$B$5:$B$29,B7,別添!$J$5:$J$29,\"有\")>0,\"有\",\"\"),\"\")","v":""},{"$f":"SUMIFS(別添!K$5:K$29,別添!$B$5:$B$29,$B7)","v":0},{"$f":"SUMIFS(別添!L$5:L$29,別添!$B$5:$B$29,$B7)","v":0},{"$f":"SUMIFS(別添!M$5:M$29,別添!$B$5:$B$29,$B7)","v":0},0]
[4,null,{"$f":"IFERROR(VLOOKUP($B8,別添!$B$5:$G$29,2,FALSE),\"\")","v":0},{"$f":"IFERROR(VLOOKUP($B8,別添!$B$5:$G$29,4,FALSE),\"\")","v":0},{"$f":"IFERROR(VLOOKUP($B8,別添!$B$5:$G$29,5,FALSE),\"\")","v":0},{"$f":"IFERROR(VLOOKUP($B8,別添!$B$5:$G$29,6,FALSE),\"\")","v":""},{"$f":"IF(M8>0,申請書!$W$7,\"\")","v":""},{"$f":"SUMIFS(別添!I$5:I$29,別添!$B$5:$B$29,$B8)","v":0},{"$f":"IFERROR(IF(COUNTIFS(別添!$B$5:$B$29,B8,別添!$J$5:$J$29,\"有\")>0,\"有\",\"\"),\"\")","v":""},{"$f":"SUMIFS(別添!K$5:K$29,別添!$B$5:$B$29,$B8)","v":0},{"$f":"SUMIFS(別添!L$5:L$29,別添!$B$5:$B$29,$B8)","v":0},{"$f":"SUMIFS(別添!M$5:M$29,別添!$B$5:$B$29,$B8)","v":0},0]
[5,null,{"$f":"IFERROR(VLOOKUP($B9,別添!$B$5:$G$29,2,FALSE),\"\")","v":0},{"$f":"IFERROR(VLOOKUP($B9,別添!$B$5:$G$29,4,FALSE),\"\")","v":0},{"$f":"IFERROR(VLOOKUP($B9,別添!$B$5:$G$29,5,FALSE),\"\")","v":0},{"$f":"IFERROR(VLOOKUP($B9,別添!$B$5:$G$29,6,FALSE),\"\")","v":""},{"$f":"IF(M9>0,申請書!$W$7,\"\")","v":""},{"$f":"SUMIFS(別添!I$5:I$29,別添!$B$5:$B$29,$B9)","v":0},{"$f":"IFERROR(IF(COUNTIFS(別添!$B$5:$B$29,B9,別添!$J$5:$J$29,\"有\")>0,\"有\",\"\"),\"\")","v":""},{"$f":"SUMIFS(別添!K$5:K$29,別添!$B$5:$B$29,$B9)","v":0},{"$f":"SUMIFS(別添!L$5:L$29,別添!$B$5:$B$29,$B9)","v":0},{"$f":"SUMIFS(別添!M$5:M$29,別添!$B$5:$B$29,$B9)","v":0},0]
[6,null,{"$f":"IFERROR(VLOOKUP($B10,別添!$B$5:$G$29,2,FALSE),\"\")","v":0},{"$f":"IFERROR(VLOOKUP($B10,別添!$B$5:$G$29,4,FALSE),\"\")","v":0},{"$f":"IFERROR(VLOOKUP($B10,別添!$B$5:$G$29,5,FALSE),\"\")","v":0},{"$f":"IFERROR(VLOOKUP($B10,別添!$B$5:$G$29,6,FALSE),\"\")","v":""},{"$f":"IF(M10>0,申請書!$W$7,\"\")","v":""},{"$f":"SUMIFS(別添!I$5:I$29,別添!$B$5:$B$29,$B10)","v":0},{"$f":"IFERROR(IF(COUNTIFS(別添!$B$5:$B$29,B10,別添!$J$5:$J$29,\"有\")>0,\"有\",\"\"),\"\")","v":""},{"$f":"SUMIFS(別添!K$5:K$29,別添!$B$5:$B$29,$B10)","v":0},{"$f":"SUMIFS(別添!L$5:L$29,別添!$B$5:$B$29,$B10)","v":0},{"$f":"SUMIFS(別添!M$5:M$29,別添!$B$5:$B$29,$B10)","v":0},0]
{"$rows_left_out":95}
{"sheet":"別添","index":3,"n_rows":32,"n_cols":40,"rows_kept":32,"cut":false,"hidden":false,"merged":[[2,4,3,4],[2,8,2,13],[2,0,3,0],[2,1,3,1],[2,2,3,2],[2,3,3,3],[2,7,3,7],[2,6,3,6],[2,5,3,5]]}
["（別添２）事業所・施設別申請額一覧（サービス別一覧）"]
[]
["No.","介護保険\n事業所番号","事業所・施設名","サービス種別","電話番号","郵便番号","住所","代表となる\n事業所・施設名","補助予定額（千円）"]
[null,null,null,null,null,null,null,null,"介護\n慰労金","20万円\n対象者の\n有無","感染対策\n費用助成\n事業","個別再開\n支援助成\n事業","再開環境\n整備助成\n事業","合計"]
[{"$f":"ROW()-4","v":1},{"$f":"IFERROR(INDIRECT(\"個票\"&$A5&\"！$h$7\"),\"\")","v":0},{"$f":"IFERROR(INDIRECT(\"個票\"&$A5&\"！$t$7\"),\"\")","v":0},{"$f":"IFERROR(INDIRECT(\"個票\"&$A5&\"！$h$10\"),\"\")","v":0},{"$f":"IFERROR(INDIRECT(\"個票\"&$A5&\"！$AC$9\"),\"\")","v":0},{"$f":"IFERROR(INDIRECT(\"個票\"&$A5&\"！$d$9\"),\"\")","v":0},{"$f":"IFERROR(INDIRECT(\"個票\"&$A5&\"！$H$9\")&INDIRECT(\"個票\"&$A5&\"！$L$9\"),\"\")","v":""},{"$f":"IF(N5>0,申請書!$W$7,\"\")","v":""},{"$f":"IFERROR(INDIRECT(\"個票\"&$A5&\"！$ai$21\"),\"\")","v":0},{"$f":"IFERROR(INDIRECT(\"個票\"&$A5&\"！$ao$22\"),\"\")","v":0},{"$f":"IFERROR(INDIRECT(\"個票\"&$A5&\"！$ai$24\"),\"\")","v":0},{"$f":"IFERROR(INDIRECT(\"個票\"&$A5&\"！$ai$39\"),\"\")","v":0},{"$f":"IFERROR(INDIRECT(\"個票\"&$A5&\"！$ai$47\"),\"\")","v":0},{"$f":"SUM(I5,K5,L5,M5)","v":0},null,null,{"$f":"IF(_xlfn.SHEETS()-8=COUNTIF(N5:N32,\">0\"),\"○\",\"！（本表の事業所数と個票の枚数が一致しません）\")","v":"！（本表の事業所数と個票の枚数が一致しません）"},null,null,null,null,null,null,null,null,null,null,null,null,null,null,null,null,null,null,null,null,null,{"$f":"IFERROR(INDIRECT(\"個票\"&$A5&\"！$m$22\"),\"\")","v":0},{"$f":"IFERROR(INDIRECT(\"個票\"&$A5&\"！$v$22\"),\"\")","v":0}]
[{"$f":"ROW()-4","v":2},{"$f":"IFERROR(INDIRECT(\"個票\"&$A6&\"！$h$7\"),\"\")","v":""},"","","","","",{"$f":"IF(N6>0,申請書!$W$7,\"\")","v":""},"","","","",{"$f":"IFERROR(INDIRECT(\"個票\"&$A6&\"！$ai$47\"),\"\")","v":""},0,null,null,null,null,null,null,null,null,null,null,null,null,null,null,null,null,null,null,null,null,null,null,null,null,{"$f":"IFERROR(INDIRECT(\"個票\"&$A6&\"！$m$22\"),\"\")","v":""},{"$f":"IFERROR(INDIRECT(\"個票\"&$A6&\"！$v$22\"),\"\")","v":""}]
[3,"","","","","","",{"$f":"IF(N7>0,申請書!$W$7,\"\")","v":""},"","","","",{"$f":"IFERROR(INDIRECT(\"個票\"&$A7&\"！$ai$47\"),\"\")","v":""},0,null,null,null,null,null,null,null,null,null,null,null,null,null,null,null,null,null,null,null,null,null,null,null,null,"",""]
[4,"","","","","","",{"$f":"IF(N8>0,申請書!$W$7,\"\")","v":""},"","","","","",0,null,null,null,null,null,null,null,null,null,null,null,null,null,null,null,null,null,null,null,null,null,null,null,null,"",""]
[5,"","","","","","",{"$f":"IF(N9>0,申請書!$W$7,\"\")","v":""},"","","","","",0,null,null,null,null,null,null,null,null,null,null,null,null,null,null,null,null,null,null,null,null,null,null,null,null,"",""]
[6,"","","","","","",{"$f":"IF(N10>0,申請書!$W$7,\"\")","v":""},"","","","","",0,null,null,null,null,null,null,null,null,null,null,null,null,null,null,null,null,null,null,null,null,null,null,null,null,"",""]
{"$rows_left_out":23}
{"sheet":"個票1","index":4,"n_rows":62,"n_cols":84,"rows_kept":62,"cut":false,"hidden":false,"merged":[[9,17,9,22],[9,7,9,16],[38,30,38,33],[44,34,44,36],[44,37,44,38],[39,37,39,38],[34,12,34,38],[35,7,35,11],[35,12,35,38],[36,12,36,38],[28,12,28,38],[29,12,29,38],[30,12,30,38],[36,7,36,11],[31,7,31,11],[32,7,32,11],[34,7,34,11],[33,7,33,11],[31,12,31,38],[32,12,32,38],[33,12,33,38],[28,7,28,11],[29,7,29,11],[30,7,30,11],[38,34,38,36],[38,37,38,38],[16,23,16,25],[18,0,18,38],[26,0,26,6],[27,12,27,38],[26,12,26,38],[27,7,27,11],[15,26,15,38],[24,37,24,38],[25,34,25,36],[25,37,25,38],[26,7,26,11],[21,30,21,32],[24,34,24,36],[20,30,20,33],[2,0,2,38],[4,0,4,38],[6,14,6,18],[7,0,8,2],[7,7,7,10],[8,7,8,10],[7,25,8,27],[6,7,6,13],[6,19,6,38],[6,0,6,6],[8,28,8,32],[7,28,7,32],[8,3,8,6],[7,3,7,6],[7,33,7,38],[8,33,8,38],[9,0,9,6],[9,23,9,24],[7,11,7,24],[8,11,8,24],[9,41,9,46],[23,37,23,38],[21,7,21,11],[21,12,21,14],[21,16,21,20],[21,21,21,23],[9,35,9,36],[9,32,9,34],[9,25,9,27],[9,28,9,29],[9,30,9,31],[10,0,11,7],[23,34,23,36],[23,23,23,27],[23,28,25,28],[9,37,9,38],[20,34,20,36],[20,37,20,38],[24,23,25,25],[24,26,25,27],[13,0,13,38],[48,37,48,38],[47,23,48,25],[47,26,48,27],[46,23,46,27],[46,28,48,28],[47,34,47,36],[47,37,47,38],[46,37,46,38],[46,34,46,36],[41,37,41,38],[42,37,42,38],[43,37,43,38],[42,23,42,25],[43,23,43,25],[39,26,39,27],[44,23,44,25],[42,26,42,27],[42,28,42,33],[42,34,42,36],[39,23,39,25],[40,37,40,38],[15,23,15,25],[16,26,16,38],[49,0,49,6],[49,7,49,11],[50,7,50,11],[51,7,51,11],[52,7,52,11],[53,7,53,11],[39,28,39,33],[39,34,39,36],[41,34,41,36],[44,26,44,27],[41,26,41,27],[41,28,41,33],[43,26,43,27],[43,28,43,33],[43,34,43,36],[48,34,48,36],[41,23,41,25],[44,28,44,33],[39,0,40,9],[40,23,40,25],[40,26,40,27],[40,28,40,33],[40,34,40,36],[41,1,44,9],[59,7,59,11],[59,12,59,38],[58,7,58,11],[49,12,49,38],[50,12,50,38],[51,12,51,38],[52,12,52,38],[53,12,53,38],[58,12,58,38],[54,7,54,11],[54,12,54,38],[55,7,55,11],[55,12,55,38],[56,7,56,11],[56,12,56,38],[57,7,57,11],[57,12,57,38]]}
["別記様式第２号（第４条関係）"]
[]
["新型コロナウイルス感染症緊急包括支援交付金（介護分）に関する事業実施実績書（事業所単位）",null,null,null,null,null,null,null,null,null,null,null,null,null,null,null,null,null,null,null,null,null,null,null,null,null,null,null,null,null,null,null,null,null,null,null,null,null,null,null,null,null,null,null,null,null,null,null,null,null,null,null,null,null,null,null,null,null,null,null,null,null,null,null,null,null,null,null,null,null,null,null,null,null,null,null,null,null,null,"（１）①　",null,null,"（２）②"]
[null,null,null,null,null,null,null,null,null,null,null,null,null,null,null,null,null,null,null,null,null,null,null,null,null,null,null,null,null,null,null,null,null,null,null,null,null,null,null,null,null,null,null,null,null,null,null,null,null,null,null,null,null,null,null,null,null,null,null,null,null,null,null,null,null,null,null,null,null,null,null,null,null,null,null,null,null,null,null,"共通",null,"単価","共通"]
["施設概要",null,null,null,null,null,null,null,null,null,null,null,null,null,null,null,null,null,null,null,null,null,null,null,null,null,null,null,null,null,null,null,null,null,null,null,null,null,null,null,null,null,null,null,null,null,null,null,null,null,null,null,null,null,null,null,null,null,null,null,null,null,null,null,null,null,null,null,null,null,null,null,null,null,null,null,null,null,"通所介護事業所（通常規模型）",892,"/事業所",null,200,"/事業所"]
[null,null,null,null,null,null,null,null,null,null,null,null,null,null,null,null,null,null,null,null,null,null,null,null,null,null,null,null,null,null,null,null,null,null,null,null,null,null,null,null,null,null,null,null,null,null,null,null,null,null,null,null,null,null,null,null,null,null,null,null,null,null,null,null,null,null,null,null,null,null,null,null,null,null,null,null,null,null,"通所介護事業所（大規模型（Ⅰ））",1137,"/事業所",null,200,"/事業所"]
["介護保険事業所番号",null,null,null,null,null,null,null,null,null,null,null,null,null,"事業所名称",null,null,null,null,null,null,null,null,null,null,null,null,null,null,null,null,null,null,null,null,null,null,null,null,null,null,null,null,null,null,null,null,null,null,null,null,null,null,null,null,null,null,null,null,null,null,null,null,null,null,null,null,null,null,null,null,null,null,null,null,null,null,null,"通所介護事業所（大規模型（Ⅱ））",1480,"/事業所",null,200,"/事業所"]
["所在地",null,null,"郵便番号",null,null,null,"都道府県名",null,null,null,"住所",null,null,null,null,null,null,null,null,null,null,null,null,null,"連絡先",null,null,"電話番号",null,null,null,null,"担当部署名",null,null,null,null,null,null,null,null,null,null,null,null,null,null,null,null,null,null,null,null,null,null,null,null,null,null,null,null,null,null,null,null,null,null,null,null,null,null,null,null,null,null,null,null,"地域密着型通所介護事業所(療養通所介護事業所を含む)",384,"/事業所",null,200,"/事業所"]
[null,null,null,null,null,null,null,null,null,null,null,null,null,null,null,null,null,null,null,null,null,null,null,null,null,null,null,null,null,null,null,null,null,null,null,null,null,null,null,null,null,null,null,null,null,null,null,null,null,null,null,null,null,null,null,null,null,null,null,null,null,null,null,null,null,null,null,null,null,null,null,null,null,null,null,null,null,null,"認知症対応型通所介護事業所",375,"/事業所",null,200,"/事業所"]
["提供サービス",null,null,null,null,null,null,null,null,null,null,null,null,null,null,null,null,"サービス種類コード",null,null,null,null,null,null,null,"定員",null,null,null,null,"人",null,"職員数\n(派遣含む)",null,null,null,null,"人",null,null,null,null,null,null,null,null,null,null,null,null,null,null,null,null,null,null,null,null,null,null,null,null,null,null,null,null,null,null,null,null,null,null,null,null,null,null,null,null,"通所リハビリテーション事業所（通常規模型）",939,"/事業所",null,200,"/事業所"]
{"$rows_left_out":53}
{"sheet":"請求書","index":5,"n_rows":36,"n_cols":12,"rows_kept":36,"cut":false,"hidden":false,"merged":[[20,0,20,11],[2,0,2,10],[9,7,9,10],[10,7,10,10],[7,5,7,6],[34,5,34,10],[22,5,22,8],[30,3,30,4],[30,5,30,10],[31,3,31,4],[31,5,31,10],[1,0,1,11],[14,5,14,10],[15,1,15,10],[16,1,16,10],[35,3,35,4],[35,5,35,10],[4,8,4,10],[8,5,8,6],[9,5,9,6],[10,5,10,6],[8,7,8,10],[32,3,32,4],[32,5,32,10],[33,3,33,4],[33,5,33,10],[34,3,34,4]]}
[]
["請　求　書"]
["令和２年度新型コロナウイルス感染症緊急包括支援交付金（介護分）（介護サービス\n事業所等感染症対策支援事業費補助金）【介護支援金】"]
[]
[null,null,null,null,null,null,null,null,"令和２年　　月　　日"]
[]
[null,"　宮崎県知事　　河野　俊嗣　　殿"]
[null,null,null,null,null,"（申請者）"]
[null,null,null,null,null,"住所"]
[null,null,null,null,null,"法人名"]
{"$rows_left_out":27}
{"sheet":"委任状","index":6,"n_rows":25,"n_cols":12,"rows_kept":25,"cut":false,"hidden":false,"merged":[[19,1,19,3],[3,0,3,10],[5,9,5,10],[10,1,13,10],[6,3,6,10],[7,3,7,10],[22,2,22,3],[23,2,23,3],[24,2,24,3],[22,4,22,10],[23,4,23,10],[24,4,24,10]]}
[]
[]
[]
["委任状"]
[]
[]
[null,"（受任者）","住所"]
[null,null,"氏名"]
[]
[]
{"$rows_left_out":16}
{"sheet":"職員表","index":7,"n_rows":85,"n_cols":21,"rows_kept":85,"cut":false,"hidden":true,"merged":[[3,15,3,18],[3,19,3,20],[3,0,4,0],[3,6,4,6],[3,7,3,9],[3,14,4,14],[3,1,4,1],[3,2,4,2],[3,3,4,3],[3,10,3,13]]}
["（様式３）介護慰労金受給職員表（法人単位）"]
[]
["※　本表は法人単位でまとめて記載すること。"]
[null,"氏名\n（漢字）","氏名\n（全角カナ）","生年月日\n（西暦）",null,null,"本人の住所","主たる勤務先",null,null,"分類",null,null,null,"慰労金\n(万円)","確認事項",null,null,null,"支払実績"]
[null,null,null,null,"（確認用）","（確認用）",null,"事業所番号","サービス種類コード","事業所・施設の名称","施設区分","対応区分","(計算用)","他の施設等との期間通算がある場合その施設名",null,"委任状の有無","他法人での慰労金の申請の有無","業務委託による\n従事者","重複\n申請者確認用","支払年月日\n(西暦)","支払金額\n（円）"]
[{"$f":"ROW()-5","v":1},null,null,null,{"$f":"B6&C6&D6","v":""},{"$f":"IF(E6=\"\",\"\",COUNTIF($E$6:$E$85,E6))","v":""},null,null,null,null,null,null,{"$f":"K6&L6","v":""},null,{"$f":"IFERROR(VLOOKUP(M6,計算用!$A$8:$B$15,2,FALSE),\"\")","v":""},null,null,null,{"$f":"IF(F6>=2,\"\",\"可\")","v":""}]
[{"$f":"ROW()-5","v":2},null,null,null,{"$f":"B7&C7&D7","v":""},{"$f":"IF(E7=\"\",\"\",COUNTIF($E$6:$E$85,E7))","v":""},null,null,null,null,null,null,{"$f":"K7&L7","v":""},null,{"$f":"IFERROR(VLOOKUP(M7,計算用!$A$8:$B$15,2,FALSE),\"\")","v":""},null,null,null,{"$f":"IF(F7>=2,\"\",\"可\")","v":""}]
[3,null,null,null,{"$f":"B8&C8&D8","v":""},{"$f":"IF(E8=\"\",\"\",COUNTIF($E$6:$E$85,E8))","v":""},null,null,null,null,null,null,"",null,{"$f":"IFERROR(VLOOKUP(M8,計算用!$A$8:$B$15,2,FALSE),\"\")","v":""},null,null,null,""]
[4,null,null,null,"",{"$f":"IF(E9=\"\",\"\",COUNTIF($E$6:$E$85,E9))","v":""},null,null,null,null,null,null,"",null,{"$f":"IFERROR(VLOOKUP(M9,計算用!$A$8:$B$15,2,FALSE),\"\")","v":""},null,null,null,""]
[5,null,null,null,"","",null,null,null,null,null,null,"",null,{"$f":"IFERROR(VLOOKUP(M10,計算用!$A$8:$B$15,2,FALSE),\"\")","v":""},null,null,null,""]
{"$rows_left_out":76}
{"sheet":"計算用","index":8,"n_rows":67,"n_cols":8,"rows_kept":67,"cut":false,"hidden":true,"merged":[]}
[null,null,null,null,null,null,null,"※本シートは絶対に編集しないこと。"]
["施設区分"]
["陽性者(濃厚接触者)発生施設","通所系･施設系で1日以上勤務又は訪問系で陽性者等に1日以上対応","訪問系で陽性者等への対応はないが対象期間に10日以上勤務","対象期間の勤務が９日以下"]
["その他の施設","対象期間に10日以上勤務","対象期間の勤務が9日以下"]
[]
[]
["慰労金単価"]
[{"$f":"A3&B3","v":"陽性者(濃厚接触者)発生施設通所系･施設系で1日以上勤務又は訪問系で陽性者等に1日以上対応"},20]
[{"$f":"A3&C3","v":"陽性者(濃厚接触者)発生施設訪問系で陽性者等への対応はないが対象期間に10日以上勤務"},5]
[{"$f":"A3&D3","v":"陽性者(濃厚接触者)発生施設対象期間の勤務が９日以下"},0]
{"$rows_left_out":57}